{"text_format":"1","workbook":"xlsx","n_sheets":3,"sheets":["Розрахунок","Аркуш3","тарифи"],"not_rendered":{"charts":0,"images":1,"macros":1,"external_links":0,"defined_names":2,"comments":1,"pivot_tables":0},"unopened":[],"bounds":{"document_bytes":16777216,"sheet_cells":100000,"rows_first":2000,"rows_last":500,"rows_between":2000,"halvings":0,"cell_chars":16384,"cell_head_chars":4096},"cells_cut":0,"cells_raw":0,"read":"whole","date_system":"1900"}

{"sheet":"Розрахунок","index":0,"n_rows":514,"n_cols":55,"rows_kept":514,"cut":false,"hidden":false,"merged":[[11,1,11,4],[11,5,11,7],[8,9,8,10],[9,1,9,4],[16,5,16,7],[9,5,9,7],[21,5,21,7],[24,5,24,7],[25,5,25,7],[31,1,31,3],[18,8,18,10],[12,1,12,4],[13,1,13,4],[14,1,14,4],[15,1,15,4],[17,1,17,4],[18,1,18,4],[21,1,21,4],[23,1,23,4],[24,1,24,4],[25,1,25,4],[22,1,22,4],[22,5,22,6],[16,1,16,4],[19,1,19,4],[19,5,19,6],[17,5,17,6],[18,5,18,6],[29,8,29,10],[30,8,30,10],[31,8,31,10],[26,1,26,4],[26,6,26,7],[50,8,50,10],[51,8,51,10],[42,8,42,10],[43,8,43,10],[44,8,44,10],[45,8,45,10],[46,8,46,10],[87,8,87,10],[88,8,88,10],[82,8,82,10],[83,8,83,10],[84,8,84,10],[85,8,85,10],[86,8,86,10],[77,8,77,10],[78,8,78,10],[79,8,79,10],[80,8,80,10],[81,8,81,10],[72,8,72,10],[73,8,73,10],[74,8,74,10],[75,8,75,10],[76,8,76,10],[32,8,32,10],[33,8,33,10],[34,8,34,10],[35,8,35,10],[36,8,36,10],[37,8,37,10],[38,8,38,10],[39,8,39,10],[40,8,40,10],[41,8,41,10],[67,8,67,10],[68,8,68,10],[69,8,69,10],[70,8,70,10],[71,8,71,10],[62,8,62,10],[63,8,63,10],[64,8,64,10],[65,8,65,10],[66,8,66,10],[57,8,57,10],[58,8,58,10],[59,8,59,10],[60,8,60,10],[61,8,61,10],[52,8,52,10],[53,8,53,10],[54,8,54,10],[55,8,55,10],[56,8,56,10],[47,8,47,10],[48,8,48,10],[49,8,49,10],[92,8,92,10],[93,8,93,10],[89,8,89,10],[90,8,90,10],[91,8,91,10],[108,8,108,10],[109,8,109,10],[110,8,110,10],[111,8,111,10],[102,8,102,10],[103,8,103,10],[104,8,104,10],[105,8,105,10],[106,8,106,10],[107,8,107,10],[97,8,97,10],[98,8,98,10],[99,8,99,10],[100,8,100,10],[101,8,101,10],[94,8,94,10],[95,8,95,10],[96,8,96,10],[127,8,127,10],[128,8,128,10],[129,8,129,10],[130,8,130,10],[131,8,131,10],[122,8,122,10],[123,8,123,10],[124,8,124,10],[125,8,125,10],[126,8,126,10],[117,8,117,10],[118,8,118,10],[119,8,119,10],[120,8,120,10],[121,8,121,10],[112,8,112,10],[113,8,113,10],[114,8,114,10],[115,8,115,10],[116,8,116,10],[147,8,147,10],[148,8,148,10],[149,8,149,10],[150,8,150,10],[151,8,151,10],[142,8,142,10],[143,8,143,10],[144,8,144,10],[145,8,145,10],[146,8,146,10],[137,8,137,10],[138,8,138,10],[139,8,139,10],[140,8,140,10],[141,8,141,10],[132,8,132,10],[133,8,133,10],[134,8,134,10],[135,8,135,10],[136,8,136,10],[167,8,167,10],[168,8,168,10],[169,8,169,10],[170,8,170,10],[171,8,171,10],[162,8,162,10],[163,8,163,10],[164,8,164,10],[165,8,165,10],[166,8,166,10],[157,8,157,10],[158,8,158,10],[159,8,159,10],[160,8,160,10],[161,8,161,10],[152,8,152,10],[153,8,153,10],[154,8,154,10],[155,8,155,10],[156,8,156,10],[187,8,187,10],[188,8,188,10],[189,8,189,10],[190,8,190,10],[191,8,191,10],[182,8,182,10],[183,8,183,10],[184,8,184,10],[185,8,185,10],[186,8,186,10],[177,8,177,10],[178,8,178,10],[179,8,179,10],[180,8,180,10],[181,8,181,10],[172,8,172,10],[173,8,173,10],[174,8,174,10],[175,8,175,10],[176,8,176,10],[207,8,207,10],[208,8,208,10],[209,8,209,10],[210,8,210,10],[211,8,211,10],[202,8,202,10],[203,8,203,10],[204,8,204,10],[205,8,205,10],[206,8,206,10],[197,8,197,10],[198,8,198,10],[199,8,199,10],[200,8,200,10],[201,8,201,10],[192,8,192,10],[193,8,193,10],[194,8,194,10],[195,8,195,10],[196,8,196,10],[227,8,227,10],[228,8,228,10],[229,8,229,10],[230,8,230,10],[231,8,231,10],[222,8,222,10],[223,8,223,10],[224,8,224,10],[225,8,225,10],[226,8,226,10],[217,8,217,10],[218,8,218,10],[219,8,219,10],[220,8,220,10],[221,8,221,10],[212,8,212,10],[213,8,213,10],[214,8,214,10],[215,8,215,10],[216,8,216,10],[247,8,247,10],[248,8,248,10],[249,8,249,10],[250,8,250,10],[251,8,251,10],[242,8,242,10],[243,8,243,10],[244,8,244,10],[245,8,245,10],[246,8,246,10],[237,8,237,10],[238,8,238,10],[239,8,239,10],[240,8,240,10],[241,8,241,10],[232,8,232,10],[233,8,233,10],[234,8,234,10],[235,8,235,10],[236,8,236,10],[267,8,267,10],[268,8,268,10],[269,8,269,10],[270,8,270,10],[271,8,271,10],[262,8,262,10],[263,8,263,10],[264,8,264,10],[265,8,265,10],[266,8,266,10],[257,8,257,10],[258,8,258,10],[259,8,259,10],[260,8,260,10],[261,8,261,10],[252,8,252,10],[253,8,253,10],[254,8,254,10],[255,8,255,10],[256,8,256,10],[287,8,287,10],[288,8,288,10],[289,8,289,10],[290,8,290,10],[291,8,291,10],[282,8,282,10],[283,8,283,10],[284,8,284,10],[285,8,285,10],[286,8,286,10],[277,8,277,10],[278,8,278,10],[279,8,279,10],[280,8,280,10],[281,8,281,10],[272,8,272,10],[273,8,273,10],[274,8,274,10],[275,8,275,10],[276,8,276,10],[307,8,307,10],[308,8,308,10],[309,8,309,10],[310,8,310,10],[311,8,311,10],[302,8,302,10],[303,8,303,10],[304,8,304,10],[305,8,305,10],[306,8,306,10],[297,8,297,10],[298,8,298,10],[299,8,299,10],[300,8,300,10],[301,8,301,10],[292,8,292,10],[293,8,293,10],[294,8,294,10],[295,8,295,10],[296,8,296,10],[327,8,327,10],[328,8,328,10],[329,8,329,10],[330,8,330,10],[331,8,331,10],[322,8,322,10],[323,8,323,10],[324,8,324,10],[325,8,325,10],[326,8,326,10],[317,8,317,10],[318,8,318,10],[319,8,319,10],[320,8,320,10],[321,8,321,10],[312,8,312,10],[313,8,313,10],[314,8,314,10],[315,8,315,10],[316,8,316,10],[339,8,339,10],[340,8,340,10],[341,8,341,10],[332,8,332,10],[333,8,333,10],[334,8,334,10],[335,8,335,10],[336,8,336,10],[356,8,356,10],[347,8,347,10],[348,8,348,10],[349,8,349,10],[350,8,350,10],[351,8,351,10],[342,8,342,10],[343,8,343,10],[344,8,344,10],[345,8,345,10],[346,8,346,10],[354,8,354,10],[355,8,355,10],[392,8,392,10],[393,8,393,10],[394,8,394,10],[387,8,387,10],[388,8,388,10],[389,8,389,10],[390,8,390,10],[391,8,391,10],[382,8,382,10],[383,8,383,10],[384,8,384,10],[385,8,385,10],[386,8,386,10],[377,8,377,10],[378,8,378,10],[379,8,379,10],[380,8,380,10],[381,8,381,10],[372,8,372,10],[373,8,373,10],[374,8,374,10],[375,8,375,10],[376,8,376,10],[367,8,367,10],[368,8,368,10],[369,8,369,10],[370,8,370,10],[371,8,371,10],[362,8,362,10],[363,8,363,10],[364,8,364,10],[10,1,10,4],[10,5,10,7],[13,5,13,7],[14,5,14,7],[15,5,15,7],[365,8,365,10],[366,8,366,10],[357,8,357,10],[358,8,358,10],[359,8,359,10],[360,8,360,10],[361,8,361,10],[352,8,352,10],[353,8,353,10],[337,8,337,10],[338,8,338,10]]}
[0,null,null,null,null,null,null,null,null,null,null,null,null,null,null,"2021-04-07"]
[0,null,null,null,null,null,null,null,null,null,null,null,{"$f":"\"Кредобанк\"&\" \"&F11&\" \"&F12&\" \"&\"аванс\"&\" \"&F14*100&\"%\"","v":"Кредобанк   аванс 60%"}]
[0]
[0]
[0]
[0]
[0]
[0]
[0,null,null,null,null,null,null,null,null,"курс валют"]
[0,"Програма кредитування",null,null,null,"Легкові авто для Бізнесу Fiat  0,0% за видачу",null,null,null,"EUR"]
[0,"Марка автомобіля",null,null,null,null,null,null,null,"USD"]
[0,"Модель автомобіля",null,null,null,null,null,null,null,"GBP"]
[0,"Вартість автомобіля",null,null,null,1700000,"UAH",{"$f":"F13*IF(G13=J10,K10,IF(G13=J11,K11,IF(G13=J12,K12,IF(G13=J13,K13,1))))","v":1700000},null,"PLN"]
[0,"Внесок вл. коштами",null,null,null,0.6]
[0,"Сума кредиту",null,null,null,{"$f":"H13*(1-F14)","v":680000}]
[0,"Термін,місяців",null,null,null,48]
[0,"Графік погашення",null,null,null,"рівномірний"]
[1,"Відтермінування",null,null,null,"відсутнє"]
[1,"Період відтермінування",null,null,null,0]
[1,"Тип відсоткової ставки",null,null,null,"фіксована "]
[1]
[0,"Відсоткова ставка",null,null,null,{"$f":"VLOOKUP(F10,тарифи!A30:G199,6,0)","v":3.4000000000000002E-2}]
[1,"% ставка з 2-го року кредитування"]
[1,"Комісії:"]
[0,"Одноразова комісія",null,null,null,{"$f":"VLOOKUP(F10,тарифи!A30:G199,7,0)","v":0}]
[0,"Дата видачі кредиту",null,null,null,"2021-03-01"]
[0,"Страхування КАСКО",null,null,null,6.5000000000000002E-2,{"$f":"F13*F27","v":110500}]
[1]
[1]
[0,null,null,null,null,null,"Всього сплачених відсотків","Всього сплачені комісії","Всього переплата клієнта"]
[0,null,null,null,null,null,{"$f":"SUM(G33:G392)","v":47203.333333333358},{"$f":"H33","v":0},{"$f":"SUM(G31:H31)","v":47203.333333333358}]
[0,"Місяць",null,null,"Залишок на початок місяця","Погашення тіла кредиту","Погашення %-ів за кредит","Разова комісія (за видачу)","Всього платіж в місяць"]
[{"$f":"IF(C33=\"\",1,0)","v":0},null,1,{"$f":"DATE(YEAR(F26),MONTH(EOMONTH(F26,0)+1),DAY(30))","v":"2021-04-30"},{"$f":"IF((C33>$F$16),0,IF($F$17=$AH$134,AW152,IF($F$18=$AE$133,AA152,AL152)))","v":680000},{"$f":"IF((C33>$F$16),0,IF($F$17=$AH$134,AX152,IF($F$18=$AE$133,AB152,AM152)))","v":14166.666666666666},{"$f":"IF((C33>$F$16),0,IF($F$17=$AH$134,AY152,IF($F$18=$AE$133,AC152,AN152)))","v":1926.6666666666667},{"$f":"F15*F25","v":0},{"$f":"IF((C33>$F$16),0,IF($F$17=$AH$134,BC152,IF($F$18=$AE$133,AG152,AR152)))","v":16093.333333333332}]
[{"$f":"IF(C34=\"\",1,0)","v":0},null,{"$f":"IF(C33<$F$16,C33+1,\"\")","v":2},{"$f":"IF(C34>$F$16,\"\",EOMONTH(D33,1))","v":"2021-05-31"},665833.33333333337,14166.666666666666,1886.5277777777781,null,16053.194444444443]
[0,null,{"$f":"IF(C34<$F$16,C34+1,\"\")","v":3},{"$f":"IF(C35>$F$16,\"\",EOMONTH(D34,1))","v":"2021-06-30"},651666.66666666674,14166.666666666666,1846.3888888888894,null,16013.055555555555]
[0,null,{"$f":"IF(C35<$F$16,C35+1,\"\")","v":4},"2021-07-31",637500.00000000012,14166.666666666666,1806.2500000000007,null,15972.916666666666]
[0,null,{"$f":"IF(C36<$F$16,C36+1,\"\")","v":5},"2021-08-31",623333.33333333349,14166.666666666666,1766.1111111111115,null,15932.777777777777]
[0,null,{"$f":"IF(C37<$F$16,C37+1,\"\")","v":6},"2021-09-30",609166.66666666686,14166.666666666666,1725.9722222222229,null,15892.638888888889]
[0,null,{"$f":"IF(C38<$F$16,C38+1,\"\")","v":7},"2021-10-31",595000.00000000023,14166.666666666666,1685.8333333333342,null,15852.5]
[0,null,{"$f":"IF(C39<$F$16,C39+1,\"\")","v":8},"2021-11-30",580833.3333333336,14166.666666666666,1645.6944444444453,null,15812.361111111111]
[0,null,{"$f":"IF(C40<$F$16,C40+1,\"\")","v":9},"2021-12-31",566666.66666666698,14166.666666666666,1605.5555555555566,null,15772.222222222223]
[0,null,{"$f":"IF(C41<$F$16,C41+1,\"\")","v":10},"2022-01-31",552500.00000000035,14166.666666666666,1565.4166666666679,null,15732.083333333334]
[0,null,{"$f":"IF(C42<$F$16,C42+1,\"\")","v":11},"2022-02-28",538333.33333333372,14166.666666666666,1525.277777777779,null,15691.944444444445]
[0,null,{"$f":"IF(C43<$F$16,C43+1,\"\")","v":12},"2022-03-31",524166.66666666704,14166.666666666666,1485.1388888888898,null,15651.805555555557]
[0,null,{"$f":"IF(C44<$F$16,C44+1,\"\")","v":13},"2022-04-30",510000.00000000035,14166.666666666666,1445.0000000000011,null,15611.666666666668]
[0,null,{"$f":"IF(C45<$F$16,C45+1,\"\")","v":14},"2022-05-31",495833.33333333366,14166.666666666666,1404.8611111111122,null,15571.527777777777]
[0,null,{"$f":"IF(C46<$F$16,C46+1,\"\")","v":15},"2022-06-30",481666.66666666698,14166.666666666666,1364.7222222222233,null,15531.388888888889]
[0,null,{"$f":"IF(C47<$F$16,C47+1,\"\")","v":16},"2022-07-31",467500.00000000029,14166.666666666666,1324.5833333333342,null,15491.25]
[0,null,{"$f":"IF(C48<$F$16,C48+1,\"\")","v":17},"2022-08-31",453333.3333333336,14166.666666666666,1284.4444444444453,null,15451.111111111111]
[0,null,{"$f":"IF(C49<$F$16,C49+1,\"\")","v":18},"2022-09-30",439166.66666666692,14166.666666666666,1244.3055555555563,null,15410.972222222223]
[0,null,{"$f":"IF(C50<$F$16,C50+1,\"\")","v":19},"2022-10-31",425000.00000000023,14166.666666666666,1204.1666666666674,null,15370.833333333334]
[0,null,{"$f":"IF(C51<$F$16,C51+1,\"\")","v":20},"2022-11-30",410833.33333333355,14166.666666666666,1164.0277777777785,null,15330.694444444445]
[0,null,{"$f":"IF(C52<$F$16,C52+1,\"\")","v":21},"2022-12-31",396666.66666666686,14166.666666666666,1123.8888888888894,null,15290.555555555555]
[0,null,{"$f":"IF(C53<$F$16,C53+1,\"\")","v":22},"2023-01-31",382500.00000000017,14166.666666666666,1083.7500000000007,null,15250.416666666666]
[0,null,{"$f":"IF(C54<$F$16,C54+1,\"\")","v":23},"2023-02-28",368333.33333333349,14166.666666666666,1043.6111111111115,null,15210.277777777777]
[0,null,{"$f":"IF(C55<$F$16,C55+1,\"\")","v":24},"2023-03-31",354166.6666666668,14166.666666666666,1003.4722222222226,null,15170.138888888889]
[0,null,{"$f":"IF(C56<$F$16,C56+1,\"\")","v":25},"2023-04-30",340000.00000000012,14166.666666666666,963.33333333333383,null,15130]
[0,null,{"$f":"IF(C57<$F$16,C57+1,\"\")","v":26},"2023-05-31",325833.33333333343,14166.666666666666,923.1944444444448,null,15089.861111111111]
[0,null,{"$f":"IF(C58<$F$16,C58+1,\"\")","v":27},"2023-06-30",311666.66666666674,14166.666666666666,883.05555555555577,null,15049.722222222223]
[0,null,{"$f":"IF(C59<$F$16,C59+1,\"\")","v":28},"2023-07-31",297500.00000000006,14166.666666666666,842.91666666666686,null,15009.583333333332]
[0,null,{"$f":"IF(C60<$F$16,C60+1,\"\")","v":29},"2023-08-31",283333.33333333337,14166.666666666666,802.77777777777794,null,14969.444444444443]
[0,null,{"$f":"IF(C61<$F$16,C61+1,\"\")","v":30},"2023-09-30",269166.66666666669,14166.666666666666,762.63888888888903,null,14929.305555555555]
[0,null,{"$f":"IF(C62<$F$16,C62+1,\"\")","v":31},"2023-10-31",255000.00000000003,14166.666666666666,722.50000000000011,null,14889.166666666666]
[0,null,{"$f":"IF(C63<$F$16,C63+1,\"\")","v":32},"2023-11-30",240833.33333333337,14166.666666666666,682.3611111111112,null,14849.027777777777]
[0,null,{"$f":"IF(C64<$F$16,C64+1,\"\")","v":33},"2023-12-31",{"$f":"IF((C65>$F$16),0,IF($F$17=$AH$134,AW184,IF($F$18=$AE$133,AA184,AL184)))","v":226666.66666666672},{"$f":"IF((C65>$F$16),0,IF($F$17=$AH$134,AX184,IF($F$18=$AE$133,AB184,AM184)))","v":14166.666666666666},{"$f":"IF((C65>$F$16),0,IF($F$17=$AH$134,AY184,IF($F$18=$AE$133,AC184,AN184)))","v":642.2222222222224},null,{"$f":"IF((C65>$F$16),0,IF($F$17=$AH$134,BC184,IF($F$18=$AE$133,AG184,AR184)))","v":14808.888888888889}]
[0,null,{"$f":"IF(C65<$F$16,C65+1,\"\")","v":34},"2024-01-31",212500.00000000006,14166.666666666666,602.0833333333336,null,14768.75]
[0,null,{"$f":"IF(C66<$F$16,C66+1,\"\")","v":35},"2024-02-29",198333.3333333334,14166.666666666666,561.94444444444468,null,14728.611111111111]
[0,null,{"$f":"IF(C67<$F$16,C67+1,\"\")","v":36},"2024-03-31",184166.66666666674,14166.666666666666,521.80555555555577,null,14688.472222222223]
[0,null,{"$f":"IF(C68<$F$16,C68+1,\"\")","v":37},"2024-04-30",170000.00000000009,14166.666666666666,481.66666666666697,null,14648.333333333332]
[0,null,{"$f":"IF(C69<$F$16,C69+1,\"\")","v":38},"2024-05-31",155833.33333333343,14166.666666666666,441.52777777777806,null,14608.194444444443]
[0,null,{"$f":"IF(C70<$F$16,C70+1,\"\")","v":39},"2024-06-30",141666.66666666677,14166.666666666666,401.3888888888892,null,14568.055555555555]
[0,null,{"$f":"IF(C71<$F$16,C71+1,\"\")","v":40},"2024-07-31",127500.0000000001,14166.666666666666,361.25000000000028,null,14527.916666666666]
[0,null,{"$f":"IF(C72<$F$16,C72+1,\"\")","v":41},"2024-08-31",113333.33333333343,14166.666666666666,321.11111111111143,null,14487.777777777777]
[0,null,{"$f":"IF(C73<$F$16,C73+1,\"\")","v":42},"2024-09-30",99166.666666666759,14166.666666666666,280.97222222222251,null,14447.638888888889]
[0,null,{"$f":"IF(C74<$F$16,C74+1,\"\")","v":43},"2024-10-31",85000.000000000087,14166.666666666666,240.8333333333336,null,14407.5]
[0,null,{"$f":"IF(C75<$F$16,C75+1,\"\")","v":44},"2024-11-30",70833.333333333416,14166.666666666666,200.69444444444468,null,14367.361111111111]
[0,null,{"$f":"IF(C76<$F$16,C76+1,\"\")","v":45},"2024-12-31",56666.666666666752,14166.666666666666,160.5555555555558,null,14327.222222222223]
[0,null,{"$f":"IF(C77<$F$16,C77+1,\"\")","v":46},"2025-01-31",42500.000000000087,14166.666666666666,120.41666666666693,null,14287.083333333332]
[0,null,{"$f":"IF(C78<$F$16,C78+1,\"\")","v":47},"2025-02-28",28333.333333333423,14166.666666666666,80.277777777778041,null,14246.944444444443]
[0,null,{"$f":"IF(C79<$F$16,C79+1,\"\")","v":48},"2025-03-31",14166.666666666757,14166.666666666666,40.138888888889149,null,14206.805555555555]
{"$rows_left_out":435}
{"sheet":"Аркуш3","index":1,"n_rows":112,"n_cols":2,"rows_kept":112,"cut":false,"hidden":true,"merged":[]}
[]
["TOB «ВіДі Автострада» ","Toyota"]
["TOB «ВіДі Еліт» ","Lexus"]
["TOB «ВіДі-Пауер» LR","Land Rover"]
["TOB «ВіДі-Пауер» J","Jaguar"]
["TOB «ВіДі-Санрайз»","Nissan"]
["TOB «ВіДі-Край Моторз»","Ford"]
["TOB «ВіДі-Скай» ","Mazda"]
["TOB «ВіДі Елеганс» ","Citroën"]
["TOB «ВіДі Авеню» ","Peugeot"]
["TOB «ВіДі-Стар» ","Subaru"]
["TOB «ВіДі Пальміра» ","Toyota"]
["TOB «ВіДі Гранд»","Suzuki"]
["TOB «ВіДі Армада»","Nissan"]
["TOB «ВіДі Інсайт» ","Honda"]
["TOB «ВіДі-Ліберті»","Infiniti"]
["TOB «ВіДі Нордвей»","Volvo"]
[]
[]
[]
["TOB «ВіДі Автострада» "]
["TOB «ВіДі Еліт» "]
["TOB «ВіДі-Пауер» "]
[]
["TOB «ВіДі-Санрайз»"]
["TOB «ВіДі-Край Моторз»"]
["TOB «ВіДі-Скай» "]
["TOB «ВіДі Елеганс» "]
["TOB «ВіДі Авеню» "]
["TOB «ВіДі-Стар» "]
["TOB «ВіДі Пальміра» "]
["TOB «ВіДі Гранд»"]
["TOB «ВіДі Армада»"]
["TOB «ВіДі Інсайт» "]
["TOB «ВіДі-Ліберті»"]
["TOB «ВіДі Нордвей»"]
[]
[]
[]
[]
[]
[]
[]
[]
[]
[]
[]
["2020-08-01"]
["2020-09-01"]
["2020-10-01"]
["2020-11-01"]
["2020-12-01"]
["2021-01-01"]
["2021-02-01"]
["2021-03-01"]
["2021-04-01"]
["2021-05-01"]
["2021-06-01"]
["2021-07-01"]
["2021-08-01"]
["2021-09-01"]
["2021-10-01"]
["2021-11-01"]
["2021-12-01"]
["2022-01-01"]
["2022-02-01"]
["2022-03-01"]
["2022-04-01"]
["2022-05-01"]
["2022-06-01"]
["2022-07-01"]
["2022-08-01"]
["2022-09-01"]
["2022-10-01"]
["2022-11-01"]
["2022-12-01"]
["2023-01-01"]
["2023-02-01"]
["2023-03-01"]
["2023-04-01"]
{"$rows_left_out":33}
{"sheet":"тарифи","index":2,"n_rows":164,"n_cols":7,"rows_kept":164,"cut":false,"hidden":true,"merged":[]}
["Легкові авто для Бізнесу Fiat 1,99% за видачу"]
["Легкові авто для Бізнесу Fiat  0,0% за видачу"]
[]
[]
[]
[]
[]
[]
[]
[]
[]
[]
[]
[]
[]
[]
[]
[]
[]
[]
[]
[]
[]
[]
[]
[]
[]
[]
[]
["Легкові авто для Бізнесу Vidi 2,99% за видачу",null,null,null,null,{"$f":"IF(Розрахунок!$F$14=тарифи!B31,VLOOKUP(Розрахунок!$F$16,тарифи!$A$32:$B$36,2,0),IF(Розрахунок!$F$14=тарифи!C31,VLOOKUP(Розрахунок!$F$16,тарифи!$A$32:$C$36,3,0),IF(Розрахунок!$F$14=тарифи!D31,VLOOKUP(Розрахунок!$F$16,тарифи!$A$32:$D$36,4,0),IF(Розрахунок!$F$14=тарифи!E31,VLOOKUP(Розрахунок!$F$16,тарифи!$A$32:$E$36,5,0)))))","v":3.6999999999999998E-2},2.9899999999999999E-2]
[null,0.3,0.4,0.5,0.6]
[12,1E-4,1E-4,1E-4,1E-4]
[24,4.2000000000000003E-2,3.2000000000000001E-2,1.9E-2,1E-4]
[36,0.06,5.1999999999999998E-2,0.04,2.3E-2]
[48,7.0000000000000007E-2,6.3E-2,5.1999999999999998E-2,3.6999999999999998E-2]
[60,7.6999999999999999E-2,7.0000000000000007E-2,6.0999999999999999E-2,4.7E-2]
[]
["Легкові авто для Бізнесу Vidi 0,0% за видачу",null,null,null,null,{"$f":"IF(Розрахунок!$F$14=тарифи!B39,VLOOKUP(Розрахунок!$F$16,тарифи!$A$40:$B$44,2,0),IF(Розрахунок!$F$14=тарифи!C39,VLOOKUP(Розрахунок!$F$16,тарифи!$A$40:$C$44,3,0),IF(Розрахунок!$F$14=тарифи!D39,VLOOKUP(Розрахунок!$F$16,тарифи!$A$40:$D$44,4,0),IF(Розрахунок!$F$14=тарифи!E39,VLOOKUP(Розрахунок!$F$16,тарифи!$A$40:$E$44,5,0)))))","v":6.2E-2},0]
[null,0.3,0.4,0.5,0.6]
[12,6.7000000000000004E-2,5.6000000000000001E-2,4.1000000000000002E-2,1.9E-2]
[24,8.1000000000000003E-2,7.2999999999999995E-2,6.0999999999999999E-2,4.2999999999999997E-2]
[36,8.6999999999999994E-2,0.08,7.0000000000000007E-2,5.3999999999999999E-2]
[48,9.1999999999999998E-2,8.5000000000000006E-2,7.5999999999999998E-2,6.2E-2]
[60,9.5000000000000001E-2,8.8999999999999996E-2,8.1000000000000003E-2,6.8000000000000005E-2]
[]
["Легкові вживані авто для Бізнесу",null,null,null,null,{"$f":"IF(Розрахунок!$F$14=тарифи!B47,VLOOKUP(Розрахунок!$F$16,тарифи!$A$48:$B$52,2,0),IF(Розрахунок!$F$14=тарифи!C47,VLOOKUP(Розрахунок!$F$16,тарифи!$A$48:$C$52,3,0),IF(Розрахунок!$F$14=тарифи!D47,VLOOKUP(Розрахунок!$F$16,тарифи!$A$48:$D$52,4,0),IF(Розрахунок!$F$14=тарифи!E47,VLOOKUP(Розрахунок!$F$16,тарифи!$A$48:$E$52,5,0)))))","v":6.2E-2},1.9900000000000001E-2]
[null,0.3,0.4,0.5,0.6]
[12,0.04,2.9000000000000001E-2,1.4E-2,1E-4]
[24,7.1999999999999995E-2,6.4000000000000001E-2,5.0999999999999997E-2,3.4000000000000002E-2]
[36,8.4000000000000005E-2,7.6999999999999999E-2,6.7000000000000004E-2,5.0999999999999997E-2]
[48,9.1999999999999998E-2,8.5000000000000006E-2,7.5999999999999998E-2,6.2E-2]
[60,9.7000000000000003E-2,9.0999999999999998E-2,8.3000000000000004E-2,7.0000000000000007E-2]
[]
["Легкові авто для Бізнесу BMW 2,99% за видачу",null,null,null,null,{"$f":"IF(Розрахунок!$F$14=тарифи!B55,VLOOKUP(Розрахунок!$F$16,тарифи!$A$56:$B$60,2,0),IF(Розрахунок!$F$14=тарифи!C55,VLOOKUP(Розрахунок!$F$16,тарифи!$A$56:$C$60,3,0),IF(Розрахунок!$F$14=тарифи!D55,VLOOKUP(Розрахунок!$F$16,тарифи!$A$56:$D$60,4,0),IF(Розрахунок!$F$14=тарифи!E55,VLOOKUP(Розрахунок!$F$16,тарифи!$A$56:$E$60,5,0)))))","v":6.2E-2},2.9899999999999999E-2]
[null,0.3,0.4,0.5,0.6]
[12,3.9E-2,3.2000000000000001E-2,2.3E-2,0.01]
[24,6.7000000000000004E-2,6.0999999999999999E-2,5.2999999999999999E-2,0.04]
[36,7.9000000000000001E-2,7.2999999999999995E-2,6.5000000000000002E-2,5.2999999999999999E-2]
[48,8.5999999999999993E-2,8.1000000000000003E-2,7.2999999999999995E-2,6.2E-2]
[60,9.0999999999999998E-2,8.5999999999999993E-2,7.9000000000000001E-2,6.9000000000000006E-2]
[]
["Легкові авто для Бізнесу BMW 0,0% за видачу",null,null,null,null,{"$f":"IF(Розрахунок!$F$14=тарифи!B63,VLOOKUP(Розрахунок!$F$16,тарифи!$A$64:$B$68,2,0),IF(Розрахунок!$F$14=тарифи!C63,VLOOKUP(Розрахунок!$F$16,тарифи!$A$64:$C$68,3,0),IF(Розрахунок!$F$14=тарифи!D63,VLOOKUP(Розрахунок!$F$16,тарифи!$A$64:$D$68,4,0),IF(Розрахунок!$F$14=тарифи!E63,VLOOKUP(Розрахунок!$F$16,тарифи!$A$64:$E$68,5,0)))))","v":7.4999999999999997E-2},0]
[null,0.3,0.4,0.5,0.6]
[12,9.2999999999999999E-2,8.6999999999999994E-2,7.6999999999999999E-2,6.4000000000000001E-2]
[24,9.5000000000000001E-2,8.8999999999999996E-2,0.08,6.8000000000000005E-2]
[36,9.7000000000000003E-2,9.1999999999999998E-2,8.4000000000000005E-2,7.1999999999999995E-2]
[48,0.1,9.4E-2,8.6999999999999994E-2,7.4999999999999997E-2]
[60,0.10199999999999999,9.7000000000000003E-2,0.09,0.08]
[]
["Легкові авто для Бізнесу Toyota 1,99% за видачу",null,null,null,null,{"$f":"IF(Розрахунок!$F$14=тарифи!B71,VLOOKUP(Розрахунок!$F$16,тарифи!$A$72:$B$76,2,0),IF(Розрахунок!$F$14=тарифи!C71,VLOOKUP(Розрахунок!$F$16,тарифи!$A$72:$C$76,3,0),IF(Розрахунок!$F$14=тарифи!D71,VLOOKUP(Розрахунок!$F$16,тарифи!$A$72:$D$76,4,0),IF(Розрахунок!$F$14=тарифи!E71,VLOOKUP(Розрахунок!$F$16,тарифи!$A$72:$E$76,5,0)))))","v":4.8000000000000001E-2},1.9900000000000001E-2]
[null,0.3,0.4,0.5,0.6]
[12,2.7E-2,1.6E-2,1E-4,1E-4]
[24,5.8000000000000003E-2,0.05,3.7999999999999999E-2,0.02]
[36,7.0999999999999994E-2,6.3E-2,5.2999999999999999E-2,3.7999999999999999E-2]
[48,7.8E-2,7.1999999999999995E-2,6.2E-2,4.8000000000000001E-2]
[60,8.4000000000000005E-2,7.8E-2,6.9000000000000006E-2,5.6000000000000001E-2]
[]
["Легкові авто для Бізнесу Toyota 0,0% за видачу",null,null,null,null,{"$f":"IF(Розрахунок!$F$14=тарифи!B79,VLOOKUP(Розрахунок!$F$16,тарифи!$A$80:$B$84,2,0),IF(Розрахунок!$F$14=тарифи!C79,VLOOKUP(Розрахунок!$F$16,тарифи!$A$80:$C$84,3,0),IF(Розрахунок!$F$14=тарифи!D79,VLOOKUP(Розрахунок!$F$16,тарифи!$A$80:$D$84,4,0),IF(Розрахунок!$F$14=тарифи!E79,VLOOKUP(Розрахунок!$F$16,тарифи!$A$80:$E$84,5,0)))))","v":5.7000000000000002E-2},0]
[null,0.3,0.4,0.5,0.6]
[12,6.3E-2,5.1999999999999998E-2,3.6999999999999998E-2,1.4E-2]
{"$rows_left_out":84}